{"text_format":"1","workbook":"xlsx","n_sheets":6,"sheets":["HOJA DE PEDIDO","EXHIBIDORES","marylin","inventario","ficha producto","LISTA PROFIT"],"not_rendered":{"charts":0,"images":0,"macros":1,"external_links":2,"defined_names":6,"comments":0,"pivot_tables":0},"unopened":[],"bounds":{"document_bytes":16777216,"sheet_cells":100000,"rows_first":2000,"rows_last":500,"rows_between":2000,"halvings":0,"cell_chars":16384,"cell_head_chars":4096},"cells_cut":0,"cells_raw":0,"read":"whole","date_system":"1900"}

{"sheet":"HOJA DE PEDIDO","index":0,"n_rows":290,"n_cols":14,"rows_kept":290,"cut":false,"hidden":false,"merged":[[289,2,289,8],[283,2,283,8],[288,2,288,8],[11,1,11,13],[30,1,30,13],[48,1,48,13],[58,1,58,13],[66,1,66,13],[87,1,87,13],[92,1,92,13],[102,1,102,13],[111,1,111,13],[9,7,9,8],[8,7,8,8],[4,7,4,8],[272,1,272,13],[215,1,215,13],[222,1,222,13],[233,1,233,13],[244,1,244,13],[253,1,253,13],[151,1,151,13],[153,1,153,13],[152,1,152,13],[179,1,179,13],[192,1,192,13],[127,1,127,13]]}
[]
[]
[]
[]
[null,null,null,null,null,null,null,"CLIENTES DIRECTOS"]
[null,null,null,"CLIENTE"]
[null,null,"RIFJ-40847190-6","VENDEDOR"]
[null,null,null,"CONDICION"]
[null,null,null,"OBSERVACION",null,null,null,"LISTA DE PRECIO $"]
[]
[]
[null,"LINEA PROTECCION BEBE"]
[null,"CODIGO","MODELO","CODIGO UPC","DESCRIPCION","UNID PAQ","UNID BULTO","PRECIO UNIDAD","PRECIO BULTO","DESCUENTO","BULTOS","UND","TOTAL","INV. BULTOS"]
[null,901060270142,"PB-HUG-RN","7702425804654","HUGGIES PANAL BEBE ACTIVE TALLA RN (RECIEN NACIDO) 32 UND",32,"06",5.14,{"$f":"+H14*G14","v":30.839999999999996},null,null,{"$f":"+K14*G14","v":0},{"$f":"L14*H14*(1-J14)","v":0},{"$f":"IFERROR(VLOOKUP(B14,inventario!$B$2:$G$164,6,0),0)","v":1684}]
[null,901060270141,"PB-HUG-P36","7702425806597","HUGGIES PANAL BEBE ACTIVE TALLA P 36 UND ","36","06",5.48,{"$f":"+G15*H15","v":32.880000000000003},7.0000000000000007E-2,null,{"$f":"+K15*G15","v":0},{"$f":"L15*H15*(1-J15)","v":0},{"$f":"IFERROR(VLOOKUP(B15,inventario!$B$2:$G$164,6,0),0)","v":2291}]
[null,901060270139,"PB-HUG-M","7702425801462","HUGGIES PANAL BEBE ACTIVE TALLA M 30 UND","30","08",5.51,44.08,7.0000000000000007E-2,null,0,0,{"$f":"IFERROR(VLOOKUP(B16,inventario!$B$2:$G$164,6,0),0)","v":1907}]
[null,901060270137,"PB-HUG-G","7702425801530","HUGGIES PANAL BEBE ACTIVE TALLA G 30 UND","30","08",6.42,51.36,0.12,null,0,{"$f":"L17*H17*(1-J17)","v":0},{"$f":"IFERROR(VLOOKUP(B17,inventario!$B$2:$G$164,6,0),0)","v":127}]
[null,901060270143,"PB-HUG-XG","7702425801615","HUGGIES PANAL BEBE ACTIVE TALLA XG 30 UND","30","08",7.72,61.76,0.12,null,0,0,{"$f":"IFERROR(VLOOKUP(B18,inventario!$B$2:$G$164,6,0),0)","v":1175}]
[null,901060270145,"PB-HUG-XXG","7702425801677","HUGGIES PANAL BEBE ACTIVE TALLA XXG 30 UND","30","08",8.34,66.72,0.12,null,0,0,{"$f":"IFERROR(VLOOKUP(B19,inventario!$B$2:$G$164,6,0),0)","v":2518}]
[null,901060270149,"PB-HUGNAT-P","7702425802155","HUGGIES PANAL BEBE NATURAL CARE (ROJOS) TALLA P 30 UND ","30","08",5.82,46.56,0.05,null,0,0,{"$f":"IFERROR(VLOOKUP(B20,inventario!$B$2:$G$164,6,0),0)","v":910}]
[null,901060270148,"PB-HUGNAT-M","7702425808690","HUGGIES PANAL BEBE NATURAL CARE (ROJOS) TALLA M 30 UND","30","08",6.72,53.76,0.05,null,0,0,{"$f":"IFERROR(VLOOKUP(B21,inventario!$B$2:$G$164,6,0),0)","v":586}]
[null,901060270147,"PB-HUGNAT-G","7702425808706","HUGGIES PANAL BEBE NATURAL CARE (ROJOS) TALLA G 30 UND ","30","08",8.1300000000000008,65.040000000000006,0.05,null,0,0,{"$f":"IFERROR(VLOOKUP(B22,inventario!$B$2:$G$164,6,0),0)","v":155}]
[null,901060270151,"PB-HUGNAT-XG","7702425802438","HUGGIES PANAL BEBE NATURAL CARE (ROJOS) TALLA XG 30 UND","30","04",9.65,38.6,0.05,null,0,0,{"$f":"IFERROR(VLOOKUP(B23,inventario!$B$2:$G$164,6,0),0)","v":0}]
[null,901060270152,"PB-HUGNAT-XXG","7702425808720","HUGGIES PANAL BEBE NATURAL CARE (ROJOS) TALLA XXG 30 UND ","30","08",10.27,82.16,0.05,null,{"$f":"+K24*G24","v":0},{"$f":"L24*H24*(1-J24)","v":0},{"$f":"IFERROR(VLOOKUP(B24,inventario!$B$2:$G$164,6,0),0)","v":3}]
[null,901060270150,"PB-HUGNAT-RN20",7702425802148,"PANAL HUGGIES NATURAL CARE RN 20un","20","08",3.75,{"$f":"+G25*H25","v":30},null,null,{"$f":"+K25*G25","v":0},{"$f":"L25*H25*(1-J25)","v":0},{"$f":"IFERROR(VLOOKUP(B25,inventario!$B$2:$G$164,6,0),0)","v":1007}]
[null,901060270138,"PB-HUG-G20",7702425810754,"PANAL HUGGIES ACTIVE SEC G 20un","20","08",4.5599999999999996,36.479999999999997,7.0000000000000007E-2,null,0,{"$f":"L26*H26*(1-J26)","v":0},{"$f":"IFERROR(VLOOKUP(B26,inventario!$B$2:$G$164,6,0),0)","v":501}]
[null,901060270144,"PB-HUG-XG20",7702425810761,"PANAL HUGGIES ACTIVE SEC XG 20un","20","08",5.48,43.84,0.15,null,0,0,{"$f":"IFERROR(VLOOKUP(B27,inventario!$B$2:$G$164,6,0),0)","v":6}]
[null,901060270146,"PB-HUG-XXG20",7702425810778,"PANAL HUGGIES ACTIVE SEC XXG 20un",20,"08",6.36,{"$f":"+H28*G28","v":50.88},0.18,null,0,0,{"$f":"IFERROR(VLOOKUP(B28,inventario!$B$2:$G$164,6,0),0)","v":1512}]
[]
[]
[null,"LINEA PROTECCION FEMENINA"]
[null,"CODIGO","MODELO","CODIGO UPC","DESCRIPCION","UNID PAQ","UNID BULTO","PRECIO UNIDAD","PRECIO BULTO","DESCUENTO","BULTOS","UND","TOTAL","INV. BULTOS"]
[null,1101070210120,"KOTEX-TAMM","7702425540613","TAMPONES KOTEX MEDIUM 12X8 SPORT","8","12",3.49,{"$f":"+G33*H33","v":41.88},7.4999999999999997E-2,null,{"$f":"+K33*G33","v":0},{"$f":"L33*H33*(1-J33)","v":0},{"$f":"IFERROR(VLOOKUP(B33,inventario!$B$2:$G$164,6,0),0)","v":0}]
[null,1101070210121,"KOTEX-TAMS","7702425540606","TAMPONES KOTEX SUPER 12X8","8","12",3.63,{"$f":"+G34*H34","v":43.56},7.4999999999999997E-2,null,0,0,{"$f":"IFERROR(VLOOKUP(B34,inventario!$B$2:$G$164,6,0),0)","v":0}]
[null,1101070190123,"KOTEX-UFNOCT","7702425807648","KOTEX TOALLA FEM UF DIA & NOCHE ","8","12",1.22,14.64,null,null,0,0,{"$f":"IFERROR(VLOOKUP(B35,inventario!$B$2:$G$164,6,0),0)","v":1721}]
[null,1101070190125,"KOTEX-ULTRAF","7702425801288","KOTEX TOALLA FEMENINA DISCRETA 10 UND","10","48",0.71,34.08,null,null,0,0,{"$f":"IFERROR(VLOOKUP(B36,inventario!$B$2:$G$164,6,0),0)","v":2129}]
[null,1101070190113,"KOTEX-DIA","7702425800779","KOTEX TOALLA FEMENINA DIURNA 10 UND","10","48",0.74,35.519999999999996,null,null,0,0,{"$f":"IFERROR(VLOOKUP(B37,inventario!$B$2:$G$164,6,0),0)","v":0}]
[null,1101070190119,"KOTEX-NOC","7702425803008","KOTEX TOALLA FEMENINA NOCTURNA 8 UND","08","12",1.03,12.36,null,null,0,0,{"$f":"IFERROR(VLOOKUP(B38,inventario!$B$2:$G$164,6,0),0)","v":0}]
[null,1101070200114,"KOTEX-LIN15","7702425544932","KOTEX PROTECTOR DIARIO FEMENINO (LINER) 15 UND ","15","12",0.55000000000000004,6.6000000000000005,null,null,0,0,{"$f":"IFERROR(VLOOKUP(B39,inventario!$B$2:$G$164,6,0),0)","v":2444}]
[null,1101070200115,"KOTEX-LIN50","7702425809765","KOTEX PROTECTOR DIARIO FEMENINO (LINER) 50 UND","50","12",1.78,21.36,7.0000000000000007E-2,null,0,0,{"$f":"IFERROR(VLOOKUP(B40,inventario!$B$2:$G$164,6,0),0)","v":4140.8333329999996}]
{"$rows_left_out":251}
{"sheet":"EXHIBIDORES","index":1,"n_rows":9,"n_cols":5,"rows_kept":9,"cut":false,"hidden":false,"merged":[[2,0,2,4]]}
[]
[]
["LINEA BATERIAS"]
["CODIGOPRODUCTO","DESCRIPCION","MARCA","ALMACEN","UNIDADES"]
["END-LG-4SV","Exhibidor Energizer PUNTA DE GONDOLA","ENERGIZER","PPAL",{"$f":"IFERROR(VLOOKUP(A5,inventario!$D$2:$G$164,4,0),0)","v":25}]
["CS-PLSTC","Exhibidor Energizer CS-PLSTC","ENERGIZER","PPAL",{"$f":"IFERROR(VLOOKUP(A6,inventario!$D$2:$G$164,4,0),0)","v":205}]
["POP-EN-MBHZ","Exhibidor Energizer MB-EX-HZ","ENERGIZER","PPAL",{"$f":"IFERROR(VLOOKUP(A7,inventario!$D$2:$G$164,4,0),0)","v":0}]
["POP-EN-SDKSM","Exhibidor Energizer SDK-SM","ENERGIZER","PPAL",{"$f":"IFERROR(VLOOKUP(A8,inventario!$D$2:$G$164,4,0),0)","v":0}]
["LIN-EGZR-AAAX6","LINTERNA ENERGIZER 50 LED + AAAX6","ENERGIZER","PPAL",{"$f":"IFERROR(VLOOKUP(A9,inventario!$D$2:$G$164,4,0),0)","v":1585}]

{"sheet":"marylin","index":2,"n_rows":277,"n_cols":5,"rows_kept":277,"cut":false,"hidden":true,"merged":[]}
["REFERENCIA","STOCK","PRECIO","DESCUENTO","DESCRIPCION"]
["ESM-MARYLIN",{"$f":"IFERROR(VLOOKUP($A2,#REF!,9,0),0)","v":0},0,{"$f":"IFERROR(VLOOKUP($A2,#REF!,8,0),0)*100","v":0},"MARYLIN ESMALTE TONOS VARIOS"]
["EU-MARY-1",{"$f":"IFERROR(VLOOKUP(A3,#REF!,9,0),0)","v":0},0,{"$f":"IFERROR(VLOOKUP($A3,#REF!,8,0),0)*100","v":0},"MARYLIN ESMALTE PROF TONO 1"]
["EU-MARY-100",{"$f":"IFERROR(VLOOKUP(A4,#REF!,9,0),0)","v":0},0,{"$f":"IFERROR(VLOOKUP($A4,#REF!,8,0),0)*100","v":0},"MARYLIN ESMALTE PROF TONO 100"]
["EU-MARY-101",{"$f":"IFERROR(VLOOKUP(A5,#REF!,9,0),0)","v":0},0,{"$f":"IFERROR(VLOOKUP($A5,#REF!,8,0),0)*100","v":0},"MARYLIN ESMALTE PROF TONO 101"]
["EU-MARY-102",{"$f":"IFERROR(VLOOKUP(A6,#REF!,9,0),0)","v":0},0,{"$f":"IFERROR(VLOOKUP($A6,#REF!,8,0),0)*100","v":0},"MARYLIN ESMALTE PROF TONO 102"]
["EU-MARY-103",{"$f":"IFERROR(VLOOKUP(A7,#REF!,9,0),0)","v":0},0,{"$f":"IFERROR(VLOOKUP($A7,#REF!,8,0),0)*100","v":0},"MARYLIN ESMALTE PROF TONO 103"]
["EU-MARY-104",{"$f":"IFERROR(VLOOKUP(A8,#REF!,9,0),0)","v":0},0,{"$f":"IFERROR(VLOOKUP($A8,#REF!,8,0),0)*100","v":0},"MARYLIN ESMALTE PROF TONO 104"]
["EU-MARY-108",{"$f":"IFERROR(VLOOKUP(A9,#REF!,9,0),0)","v":0},0,{"$f":"IFERROR(VLOOKUP($A9,#REF!,8,0),0)*100","v":0},"MARYLIN ESMALTE PROF TONO 108"]
["EU-MARY-109",{"$f":"IFERROR(VLOOKUP(A10,#REF!,9,0),0)","v":0},0,{"$f":"IFERROR(VLOOKUP($A10,#REF!,8,0),0)*100","v":0},"MARYLIN ESMALTE PROF TONO 109"]
["EU-MARY-110",{"$f":"IFERROR(VLOOKUP(A11,#REF!,9,0),0)","v":0},0,{"$f":"IFERROR(VLOOKUP($A11,#REF!,8,0),0)*100","v":0},"MARYLIN ESMALTE PROF TONO 110"]
["EU-MARY-115",{"$f":"IFERROR(VLOOKUP(A12,#REF!,9,0),0)","v":0},0,{"$f":"IFERROR(VLOOKUP($A12,#REF!,8,0),0)*100","v":0},"MARYLIN ESMALTE PROF TONO 115"]
["EU-MARY-116",{"$f":"IFERROR(VLOOKUP(A13,#REF!,9,0),0)","v":0},0,{"$f":"IFERROR(VLOOKUP($A13,#REF!,8,0),0)*100","v":0},"MARYLIN ESMALTE PROF TONO 116"]
["EU-MARY-117",{"$f":"IFERROR(VLOOKUP(A14,#REF!,9,0),0)","v":0},0,{"$f":"IFERROR(VLOOKUP($A14,#REF!,8,0),0)*100","v":0},"MARYLIN ESMALTE PROF TONO 117"]
["EU-MARY-118",{"$f":"IFERROR(VLOOKUP(A15,#REF!,9,0),0)","v":0},0,{"$f":"IFERROR(VLOOKUP($A15,#REF!,8,0),0)*100","v":0},"MARYLIN ESMALTE PROF TONO 118"]
["EU-MARY-119",{"$f":"IFERROR(VLOOKUP(A16,#REF!,9,0),0)","v":0},0,{"$f":"IFERROR(VLOOKUP($A16,#REF!,8,0),0)*100","v":0},"MARYLIN ESMALTE PROF TONO 119"]
["EU-MARY-12",{"$f":"IFERROR(VLOOKUP(A17,#REF!,9,0),0)","v":0},0,{"$f":"IFERROR(VLOOKUP($A17,#REF!,8,0),0)*100","v":0},"MARYLIN ESMALTE PROF TONO 12"]
["EU-MARY-120",{"$f":"IFERROR(VLOOKUP(A18,#REF!,9,0),0)","v":0},0,{"$f":"IFERROR(VLOOKUP($A18,#REF!,8,0),0)*100","v":0},"MARYLIN ESMALTE PROF TONO 120"]
["EU-MARY-123",{"$f":"IFERROR(VLOOKUP(A19,#REF!,9,0),0)","v":0},0,{"$f":"IFERROR(VLOOKUP($A19,#REF!,8,0),0)*100","v":0},"MARYLIN ESMALTE PROF TONO 123"]
["EU-MARY-126",{"$f":"IFERROR(VLOOKUP(A20,#REF!,9,0),0)","v":0},0,{"$f":"IFERROR(VLOOKUP($A20,#REF!,8,0),0)*100","v":0},"MARYLIN ESMALTE PROF TONO 126"]
["EU-MARY-13",{"$f":"IFERROR(VLOOKUP(A21,#REF!,9,0),0)","v":0},0,{"$f":"IFERROR(VLOOKUP($A21,#REF!,8,0),0)*100","v":0},"MARYLIN ESMALTE PROF TONO 13"]
["EU-MARY-132",{"$f":"IFERROR(VLOOKUP(A22,#REF!,9,0),0)","v":0},0,{"$f":"IFERROR(VLOOKUP($A22,#REF!,8,0),0)*100","v":0},"MARYLIN ESMALTE PROF TONO 132"]
["EU-MARY-135",{"$f":"IFERROR(VLOOKUP(A23,#REF!,9,0),0)","v":0},0,{"$f":"IFERROR(VLOOKUP($A23,#REF!,8,0),0)*100","v":0},"MARYLIN ESMALTE PROF TONO 135"]
["EU-MARY-136",{"$f":"IFERROR(VLOOKUP(A24,#REF!,9,0),0)","v":0},0,{"$f":"IFERROR(VLOOKUP($A24,#REF!,8,0),0)*100","v":0},"MARYLIN ESMALTE PROF TONO 136"]
["EU-MARY-14",{"$f":"IFERROR(VLOOKUP(A25,#REF!,9,0),0)","v":0},0,{"$f":"IFERROR(VLOOKUP($A25,#REF!,8,0),0)*100","v":0},"MARYLIN ESMALTE PROF TONO 14"]
["EU-MARY-150",{"$f":"IFERROR(VLOOKUP(A26,#REF!,9,0),0)","v":0},0,{"$f":"IFERROR(VLOOKUP($A26,#REF!,8,0),0)*100","v":0},"MARYLIN ESMALTE PROF TONO 150"]
["EU-MARY-153",{"$f":"IFERROR(VLOOKUP(A27,#REF!,9,0),0)","v":0},0,{"$f":"IFERROR(VLOOKUP($A27,#REF!,8,0),0)*100","v":0},"MARYLIN ESMALTE PROF TONO 153"]
["EU-MARY-156",{"$f":"IFERROR(VLOOKUP(A28,#REF!,9,0),0)","v":0},0,{"$f":"IFERROR(VLOOKUP($A28,#REF!,8,0),0)*100","v":0},"MARYLIN ESMALTE PROF TONO 156"]
["EU-MARY-157",{"$f":"IFERROR(VLOOKUP(A29,#REF!,9,0),0)","v":0},0,{"$f":"IFERROR(VLOOKUP($A29,#REF!,8,0),0)*100","v":0},"MARYLIN ESMALTE PROF TONO 157"]
["EU-MARY-158",{"$f":"IFERROR(VLOOKUP(A30,#REF!,9,0),0)","v":0},0,{"$f":"IFERROR(VLOOKUP($A30,#REF!,8,0),0)*100","v":0},"MARYLIN ESMALTE PROF TONO 158"]
["EU-MARY-159",{"$f":"IFERROR(VLOOKUP(A31,#REF!,9,0),0)","v":0},0,{"$f":"IFERROR(VLOOKUP($A31,#REF!,8,0),0)*100","v":0},"MARYLIN ESMALTE PROF TONO 159"]
["EU-MARY-16",{"$f":"IFERROR(VLOOKUP(A32,#REF!,9,0),0)","v":0},0,{"$f":"IFERROR(VLOOKUP($A32,#REF!,8,0),0)*100","v":0},"MARYLIN ESMALTE PROF TONO 16"]
["EU-MARY-160",{"$f":"IFERROR(VLOOKUP(A33,#REF!,9,0),0)","v":0},0,{"$f":"IFERROR(VLOOKUP($A33,#REF!,8,0),0)*100","v":0},"MARYLIN ESMALTE PROF TONO 160"]
["EU-MARY-161",{"$f":"IFERROR(VLOOKUP(A34,#REF!,9,0),0)","v":0},0,{"$f":"IFERROR(VLOOKUP($A34,#REF!,8,0),0)*100","v":0},"MARYLIN ESMALTE PROF TONO 161"]
["EU-MARY-162",{"$f":"IFERROR(VLOOKUP(A35,#REF!,9,0),0)","v":0},0,{"$f":"IFERROR(VLOOKUP($A35,#REF!,8,0),0)*100","v":0},"MARYLIN ESMALTE PROF TONO 162"]
["EU-MARY-163",{"$f":"IFERROR(VLOOKUP(A36,#REF!,9,0),0)","v":0},0,{"$f":"IFERROR(VLOOKUP($A36,#REF!,8,0),0)*100","v":0},"MARYLIN ESMALTE PROF TONO 163"]
["EU-MARY-164",{"$f":"IFERROR(VLOOKUP(A37,#REF!,9,0),0)","v":0},0,{"$f":"IFERROR(VLOOKUP($A37,#REF!,8,0),0)*100","v":0},"MARYLIN ESMALTE PROF TONO 164"]
["EU-MARY-165",{"$f":"IFERROR(VLOOKUP(A38,#REF!,9,0),0)","v":0},0,{"$f":"IFERROR(VLOOKUP($A38,#REF!,8,0),0)*100","v":0},"MARYLIN ESMALTE PROF TONO 165"]
["EU-MARY-166",{"$f":"IFERROR(VLOOKUP(A39,#REF!,9,0),0)","v":0},0,{"$f":"IFERROR(VLOOKUP($A39,#REF!,8,0),0)*100","v":0},"MARYLIN ESMALTE PROF TONO 166"]
["EU-MARY-168",{"$f":"IFERROR(VLOOKUP(A40,#REF!,9,0),0)","v":0},0,{"$f":"IFERROR(VLOOKUP($A40,#REF!,8,0),0)*100","v":0},"MARYLIN ESMALTE PROF TONO 168"]
{"$rows_left_out":238}
{"sheet":"inventario","index":3,"n_rows":151,"n_cols":8,"rows_kept":151,"cut":false,"hidden":true,"merged":[]}
[]
[null,"CODIGO","DESCRIPCION","MODELO","REFERENCIA","ALMACEN","STOCK ACTUAL","BULTOS"]
[null,101010040015,"AMMENS TALCO BABY 12X125G","AMMENS-BABY125",7502221182181,1,579,"BUL"]
[null,101010040017,"AMMENS TALCO FRESH 12X125G","AMMENS-FRESH125",7502221182167,1,722,"BUL"]
[null,101010040019,"AMMENS TALCO ORIGINAL 12X125G","AMMENS-ORI125",7502221182143,1,682,"BUL"]
[null,101010040020,"AMMENS TALCO PIE 12X60G","AMMENS-PIE60",7502221184437,1,720,"BUL"]
[null,202020150085,"A&H DETER LIQ JARDIN FLOR 8X1.47L","DL-AHJARDIN","REPETID",1,2,"BUL"]
[null,301020030057,"AXE DEO STICK COLLISION 12X50G","DEO-AXSTI-COLL",75060206,1,601,"BUL"]
[null,301020030197,"AXE DEO STICK BLACK 12X50G","DEO-AXSTI-BLK",75048082,1,488,"BUL"]
[null,301020120048,"AXE BS APOLLO 12X150ML","DEO-AXBS-APOLLO",7791293025780,1,1402,"BUL"]
[null,301020120050,"AXE BS BLACK NIGHT 12X150ML","DEO-AXBS-BLKNGHT",7791293032153,1,3099,"BUL"]
[null,301020120051,"AXE BS COLLISION 12X150ML","DEO-AXBS-COLL",7506306202832,1,2324,"BUL"]
[null,301020120053,"AXE BS DARK TEMPTATION 12X150ML","DEO-AXBS-DARKT",7791293025797,1,2114,"BUL"]
[null,301020120054,"AXE BS EXCITE 12X150ML","DEO-AXBS-EXCITE",7791293025803,1,2777,"BUL"]
[null,301020120055,"AXE BS FUSION 12X150ML","DEO-AXBS-FUSION",7791293025810,1,1970,"BUL"]
[null,501010050021,"COTTON SOFT BOLAS ALG 40X50UND","BA-CSOFT-50",null,1,96,"BUL"]
[null,501010050203,"COTTON SOFT HISOPOS 100UND","HA-CSOFT-100",5115203,1,2,"UND"]
[null,601020030061,"DOVE DEO STICK DERMO ACLARANT 12X50G","DEO-DOVDERM-S50",75034238,1,654,"BUL"]
[null,601020130059,"DOVE DEO AER AP DERMO ACLARANT 12X89G/150ML","DEO-DOVDERM-A150",7506306241152,1,277,"BUL"]
[null,601020130062,"DOVE DEO AER MEN INVI DRY12X89G/150ML","DEO-DOVMINV-A150",7791293022819,1,143,"BUL"]
[null,601020130064,"DOVE DEO WOMEN AER ORIGINAL BIPACK 6X2X89G/150ML","DEO-DOVORG-2PK",7702006201032,1,119,"BUL"]
[null,601020130065,"DOVE DEO AER AP ORIGINAL 12X89G/150ML","DEO-DOVORG-A150",7506306241183,1,905,"BUL"]
[null,601020140060,"DOVE DEO ROLLON DERMO ACLARANT 12X50ML","DEO-DOVDERM-R50",78928503,1,383,"BUL"]
[null,601030010001,"DOVE ACONDICIONADOR OLEO NUTRICION 12X400ML","AC-DOVOLEO-400",7891150017337,1,821,"BUL"]
[null,601030010002,"DOVE ACONDICIONADOR RECONS COMPLETA 12X400ML","AC-DOVRECON-400",null,1,1045,"BUL"]
[null,601030010218,"DOVE BAÑO DE CREMA CONCENTRADO RECONS 6X300G","BC-DOVRECON-300",7891150058613,1,230,"BUL"]
[null,601030340174,"DOVE SHAMPOO RECONS COMPLETA 12X400ML","SH-DOVRECON-400",7791293005010,1,1122,"BUL"]
[null,601050180094,"DOVE JABON ORIGINAL 48X90G","JB-DOVORG-90",7898422746759,1,1142,"BUL"]
[null,601050180095,"DOVE JABON KAR Y VAINILLA 48X90G","JB-DOVVAN-90",7891150019560,1,1248,"BUL"]
[null,702010230130,"ENERGIZER LINTERNA 50 LED + AAAX6","LIN-EGZR-AAAX6",null,1,1585,"BUL"]
[null,702010290154,"ENERGIZER BAT ALK 24X9V","PIL-EGZR-9V",39800013613,1,330,"BUL"]
[null,702010290156,"ENERGIZER BAT ALK 24XAAAX2","PIL-EGZR-AAAX2",39800014009,1,109,"BUL"]
[null,702010290158,"ENERGIZER BAT ALK 24XAAX2","PIL-EGZR-AAX2",39800015464,1,126,"BUL"]
[null,702010290161,"ENERGIZER BAT ALK 12XDX2","PIL-EGZR-DX2",39800011398,1,1,"BUL"]
[null,705010370202,"EXHIBIDOR ENERGIZER PUNTA DE GONDOLA","END-LG-4SV",null,1,25,"UND"]
[null,705010370207,"ENERGIZER EXHIBIDOR DE PIE / ISLA (FS-SM)","ISL-XSM",null,1,5,"UND"]
[null,705010370213,"ENERGIZER EXHIBIDOR RISTRA PLASTICA (CS-PLSTC)","CS-PLSTC",null,1,205,"UND"]
[null,802010290163,"EVEREADY BAT 24XAAX4","PIL-EVR-AAX4",39800040008,1,32,"BUL"]
[null,802010290164,"EVEREADY BAT 12XCX2","PIL-EVR-CX2",39800059154,1,335.91666700000002,"BUL"]
[null,802010290165,"EVEREADY BAT 12XDX2","PIL-EVR-DX2",39800059352,1,281,"BUL"]
{"$rows_left_out":112}
{"sheet":"ficha producto","index":4,"n_rows":306,"n_cols":9,"rows_kept":306,"cut":false,"hidden":true,"merged":[]}
[]
[]
[]
[null,"CODIGO","TIPO","MANEJA SERIALES","INACTIVO","FECHA DE REGISTRO","DESCRIPCION","MODELO","UNIDADDEEMPAQUE"]
[null,"AC-DOVOLEO-400","V","NO","NO","2021-01-14","ACONDICIONADOR DOVE OLEO NUTRICION 12X400ML","DOVE",12]
[null,"AC-DOVRECON-400","V","NO","NO","2021-01-14","ACONDICIONADOR DOVE RECONSTRUCCION COMPLETA 12X400ML","DOVE",12]
[null,"AC-SEDCERA-340","V","NO","NO","2021-01-14","ACONDICIONADOR SEDAL CERAMIDAS 12X340ML","SEDAL",12]
[null,"AC-SEDKERA-340","V","NO","NO","2021-01-14","ACONDICIONADOR SEDAL KERAT C/ANTIOX 12X340ML","SEDAL",12]
[null,"AC-SEDRIZOS-340","V","NO","NO","2021-01-14","ACONDICIONADOR SEDAL RIZOS DEFINIDOS 12X340ML","SEDAL",12]
[null,"AC-SUAMIEL-360","V","NO","NO","2020-11-26","SUAVE AC MIEL Y ALMENDRA 12X360ML","SUAVE",12]
[null,"AH-DENT-ADWH","V","NO","NO","2020-06-26","PAST DENT ARM&HAMMER ADVANCE W","ARM & HAMMER",12]
[null,"AH-DENT-CCARE","V","NO","NO","2020-06-26","PAST DENT ARM&HAMMER COMPL CARE","ARM & HAMMER",12]
[null,"AH-DENT-PEROX","V","NO","NO","2020-06-26","PAST DENT ARM&HAMMER PEROX","ARM & HAMMER",12]
[null,"AH-FRESH","V","NO","NO","2020-06-26","DEO ARM&HAMMER SOLID FRESH","ARM & HAMMER",12]
[null,"AH-GELCOOL","V","NO","NO","2020-06-26","DEO ARM&HAMMER GEL COOL BLAST","ARM & HAMMER",12]
[null,"AH-MAXPWER","V","NO","NO","2020-06-26","DEO ARM&HAMMER POWDER FRESH","ARM & HAMMER",12]
[null,"AH-MAXSPORT","V","NO","NO","2020-06-26","DEO ARM&HAMMER ACTIVE SPORT","ARM & HAMMER",12]
[null,"AH-UNSCENTED","V","NO","NO","2020-06-26","DEO ARM&HAMMER SOLID UNSCENTED","ARM & HAMMER",12]
[null,"AMMENS-BABY125","V","NO","NO","2020-06-26","TALCO AMMENS BABY 125GR","AMMENS",12]
[null,"AMMENS-FRESH125","V","NO","NO","2020-06-26","TALCO AMMENS FRESH 125GR","AMMENS",12]
[null,"AMMENS-ORI125","V","NO","NO","2020-06-26","TALCO AMMENS ORIGINAL 125GR","AMMENS",12]
[null,"AMMENS-PIE60","V","NO","NO","2020-06-26","TALCO AMMENS PIE 60GR","AMMENS",12]
[null,"BA-CSOFT-50","V","NO","NO","2020-06-26","BOLAS DE ALG 50 UNIDADES COTTON SOFT","COTTON SOFT",40]
[null,"CF-PONDBIO-100","V","NO","NO","2020-11-26","PONDS CR BIOHIDRATANTE 24X100G","PONDS",24]
[null,"CF-PONDBIO-50","V","NO","NO","2020-11-26","PONDS CR BIOHIDRATANTE 24X50G","PONDS",24]
[null,"CF-PONDC-45","V","NO","NO","2020-11-26","PONDS CR C ORIGINAL 24X45G","PONDS",24]
[null,"CF-PONDC-95","V","NO","NO","2020-11-26","PONDS CR C ORIGINAL 24X95G","PONDS",24]
[null,"CF-PONDC-SCH10","V","NO","NO","2020-11-26","PONDS CR C ORIGINAL DPL 12X10X10G","PONDS",120]
[null,"CF-PONDCLAR-100","V","NO","NO","2020-11-26","PONDS CR CLARANT B3 GRASA 24X100G","PONDS",24]
[null,"CF-PONDCLAR-50","V","NO","NO","2020-11-26","PONDS CR CLARANT B3 GRASA 24X50G","PONDS",24]
[null,"CF-PONDCPEP-100","V","NO","NO","2020-11-26","PONDS CR C PEPINO 24X100G","PONDS",24]
[null,"CF-PONDH-100","V","NO","NO","2020-11-26","PONDS CR H 24X100G","PONDS",24]
[null,"CF-PONDH-50","V","NO","NO","2020-11-26","PONDS CR H 24X50G","PONDS",24]
[null,"CF-PONDHC-2PK","V","NO","NO","2021-05-06","PONDS DUO PACK H100 C45","PONDS",18]
[null,"CF-PONDREJ-100","V","NO","NO","2020-11-26","PONDS CR REJUVENESS DIA 24X100G","PONDS",24]
[null,"CF-PONDREJ-50","V","NO","NO","2020-11-26","PONDS CR REJUVENESS  24X50G","PONDS",24]
[null,"CF-PONDREJ-SCH10","V","NO","NO","2020-11-26","PONDS CR REJUVENESS SCH 12X10X10G","PONDS",120]
[null,"CF-PONDS-100","V","NO","NO","2020-11-26","PONDS CR S HUMECTANTE NUTRITIVA 24X100G","PONDS",24]
[null,"CF-PONDS-50","V","NO","NO","2020-11-26","PONDS CR S HUMECTANTE NUTRITIVA 24X50G","PONDS",24]
[null,"CF-PONDS-SCH10","V","NO","NO","2020-11-26","PONDS CR S SCH 12X10X10G","PONDS",120]
{"$rows_left_out":267}
{"sheet":"LISTA PROFIT","index":5,"n_rows":296,"n_cols":14,"rows_kept":296,"cut":false,"hidden":true,"merged":[]}
[]
[]
[null,"LINEA","MODELO","CODIGO ARTICULO","ARTICULO","PRECIO 1","PRECIO 2","PRECIO 3","PRECIO 4","PRECIO 5"]
[null,1,null,"ESM-MARYLIN","MARYLIN ESMALTE TONOS VARIOS",1593750,1593750,1593750,1683000,0.51]
[null,1,"MARYLIN","EU-MARY-1","MARYLIN ESMALTE PROF TONO 1",1593750,1593750,1593750,1683000,0.51]
[null,1,"MARYLIN","EU-MARY-100","MARYLIN ESMALTE PROF TONO 100",1593750,1593750,1593750,1683000,0.51]
[null,1,"MARYLIN","EU-MARY-101","MARYLIN ESMALTE PROF TONO 101",1593750,1593750,1593750,1683000,0.51]
[null,1,"MARYLIN","EU-MARY-102","MARYLIN ESMALTE PROF TONO 102",1593750,1593750,1593750,1683000,0.51]
[null,1,"MARYLIN","EU-MARY-103","MARYLIN ESMALTE PROF TONO 103",1593750,1593750,1593750,1683000,0.51,null,null,null,0.57999999999999996]
[null,1,"MARYLIN","EU-MARY-104","MARYLIN ESMALTE PROF TONO 104",1593750,1593750,1593750,1683000,0.51]
[null,1,"MARYLIN","EU-MARY-108","MARYLIN ESMALTE PROF TONO 108",1593750,1593750,1593750,1683000,0.51]
[null,1,"MARYLIN","EU-MARY-109","MARYLIN ESMALTE PROF TONO 109",1593750,1593750,1593750,1683000,0.51]
[null,1,"MARYLIN","EU-MARY-110","MARYLIN ESMALTE PROF TONO 110",1593750,1593750,1593750,1683000,0.51]
[null,1,"MARYLIN","EU-MARY-115","MARYLIN ESMALTE PROF TONO 115",1593750,1593750,1593750,1683000,0.51]
[null,1,"MARYLIN","EU-MARY-116","MARYLIN ESMALTE PROF TONO 116",1593750,1593750,1593750,1683000,0.51]
[null,1,"MARYLIN","EU-MARY-117","MARYLIN ESMALTE PROF TONO 117",1593750,1593750,1593750,1683000,0.51]
[null,1,"MARYLIN","EU-MARY-118","MARYLIN ESMALTE PROF TONO 118",1593750,1593750,1593750,1683000,0.51]
[null,1,"MARYLIN","EU-MARY-119","MARYLIN ESMALTE PROF TONO 119",1593750,1593750,1593750,1683000,0.51]
[null,1,"MARYLIN","EU-MARY-12","MARYLIN ESMALTE PROF TONO 12",1593750,1593750,1593750,1683000,0.51]
[null,1,"MARYLIN","EU-MARY-120","MARYLIN ESMALTE PROF TONO 120",1593750,1593750,1593750,1683000,0.51]
[null,1,"MARYLIN","EU-MARY-123","MARYLIN ESMALTE PROF TONO 123",1593750,1593750,1593750,1683000,0.51]
[null,1,"MARYLIN","EU-MARY-126","MARYLIN ESMALTE PROF TONO 126",1593750,1593750,1593750,1683000,0.51]
[null,1,"MARYLIN","EU-MARY-13","MARYLIN ESMALTE PROF TONO 13",1593750,1593750,1593750,1683000,0.51]
[null,1,"MARYLIN","EU-MARY-132","MARYLIN ESMALTE PROF TONO 132",1593750,1593750,1593750,1683000,0.51]
[null,1,"MARYLIN","EU-MARY-135","MARYLIN ESMALTE PROF TONO 135",1593750,1593750,1593750,1683000,0.51]
[null,1,"MARYLIN","EU-MARY-136","MARYLIN ESMALTE PROF TONO 136",1593750,1593750,1593750,1683000,0.51]
[null,1,"MARYLIN","EU-MARY-14","MARYLIN ESMALTE PROF TONO 14",1593750,1593750,1593750,1683000,0.51]
[null,1,"MARYLIN","EU-MARY-150","MARYLIN ESMALTE PROF TONO 150",1593750,1593750,1593750,1683000,0.51]
[null,1,"MARYLIN","EU-MARY-153","MARYLIN ESMALTE PROF TONO 153",1593750,1593750,1593750,1683000,0.51]
[null,1,"MARYLIN","EU-MARY-156","MARYLIN ESMALTE PROF TONO 156",1593750,1593750,1593750,1683000,0.51]
[null,1,"MARYLIN","EU-MARY-157","MARYLIN ESMALTE PROF TONO 157",1593750,1593750,1593750,1683000,0.51]
[null,1,"MARYLIN","EU-MARY-158","MARYLIN ESMALTE PROF TONO 158",1593750,1593750,1593750,1683000,0.51]
[null,1,"MARYLIN","EU-MARY-159","MARYLIN ESMALTE PROF TONO 159",1593750,1593750,1593750,1683000,0.51]
[null,1,"MARYLIN","EU-MARY-16","MARYLIN ESMALTE PROF TONO 16",1593750,1593750,1593750,1683000,0.51]
[null,1,"MARYLIN","EU-MARY-160","MARYLIN ESMALTE PROF TONO 160",1593750,1593750,1593750,1683000,0.51]
[null,1,"MARYLIN","EU-MARY-161","MARYLIN ESMALTE PROF TONO 161",1593750,1593750,1593750,1683000,0.51]
[null,1,"MARYLIN","EU-MARY-162","MARYLIN ESMALTE PROF TONO 162",1593750,1593750,1593750,1683000,0.51]
[null,1,"MARYLIN","EU-MARY-163","MARYLIN ESMALTE PROF TONO 163",1593750,1593750,1593750,1683000,0.51]
[null,1,"MARYLIN","EU-MARY-164","MARYLIN ESMALTE PROF TONO 164",1593750,1593750,1593750,1683000,0.51]
[null,1,"MARYLIN","EU-MARY-165","MARYLIN ESMALTE PROF TONO 165",1593750,1593750,1593750,1683000,0.51]
{"$rows_left_out":256}